Target
Isocitrate dehydrogenase [NADP] cytoplasmic
Ligand
BDBM50111792
Substrate
Meas. Tech.
ChEMBL_1510683 (CHEMBL3606169)
Ki
3600±n/a nM
Citation
 Wu, FJiang, HZheng, BKogiso, MYao, YZhou, CLi, XNSong, Y Inhibition of Cancer-Associated Mutant Isocitrate Dehydrogenases by 2-Thiohydantoin Compounds. J Med Chem 58:6899-908 (2015)  
Target
Name:
Isocitrate dehydrogenase [NADP] cytoplasmic
Synonyms:
Cytosolic NADP-isocitrate dehydrogenase IDH1 IDP Isocitrate dehydrogenase 1 (IDH1) Oxalosuccinate decarboxylase | PICD
Type:
Protein
Mol. Mass.:
46661.29
Organism:
Homo sapiens (Human)
Description:
O75874
Residue:
414
  
Inhibitor
Name:
BDBM50111792
Synonyms:
CHEMBL3605380
Type:
Small organic molecule
Emp. Form.:
C11H11N3O2S
Mol. Mass.:
249.289
SMILES:
CCN1C(=S)N\C(=C\c2ccc(=O)[nH]c2)C1=O
: