Target
Serine/threonine-protein kinase PAK 4
Ligand
BDBM50112350
Substrate
Meas. Tech.
ChEMBL_1513232 (CHEMBL3610940)
Kd
>40000±n/a nM
Citation
 Karpov, ASAmiri, PBellamacina, CBellance, MHBreitenstein, WDaniel, DDenay, RFabbro, DFernandez, CGaluba, IGuerro-Lagasse, SGutmann, SHinh, LJahnke, WKlopp, JLai, ALindvall, MKMa, SMöbitz, HPecchi, SRummel, GShoemaker, KTrappe, JVoliva, CCowan-Jacob, SWMarzinzik, AL Optimization of a Dibenzodiazepine Hit to a Potent and Selective Allosteric PAK1 Inhibitor. ACS Med Chem Lett 6:776-81 (2015)  
Target
Name:
Serine/threonine-protein kinase PAK 4
Synonyms:
KIAA1142 PAK4_HUMAN | p21-Activated kinase 4 (PAK4)
Type:
Protein
Mol. Mass.:
64098.01
Organism:
Homo sapiens (Human)
Description:
O96013
Residue:
591
  
Inhibitor
Name:
BDBM50112350
Synonyms:
CHEMBL3609370
Type:
Small organic molecule
Emp. Form.:
C24H28ClFN4O2
Mol. Mass.:
458.956
SMILES:
CCN1c2ccc(F)cc2N=C(N[C@H]2CCN(C2)C(=O)OC(C)(C)C)c2cc(Cl)ccc12
: