Target
LIP1, secretory lipase (Family 3)
Ligand
BDBM50112880
Substrate
Meas. Tech.
ChEMBL_1512202 (CHEMBL3611484)
IC50
>200000±n/a nM
Citation
 Guo, SHuang, WZhang, JWang, Y Novel inhibitor against Malassezia globosa LIP1 (SMG1), a potential anti-dandruff target. Bioorg Med Chem Lett 25:3464-7 (2015)  
Target
Name:
LIP1, secretory lipase (Family 3)
Synonyms:
LIP1, secretory lipase (Family 3)
Type:
PROTEIN
Mol. Mass.:
33701.74
Organism:
Malassezia globosa (strain ATCC MYA-4612 / CBS 7966)(Dandruff-associated fungus)
Description:
ChEMBL_109860
Residue:
304
  
Inhibitor
Name:
BDBM50112880
Synonyms:
CHEMBL3609535
Type:
Small organic molecule
Emp. Form.:
C15H16N2O2S2
Mol. Mass.:
320.43
SMILES:
O=C1N(CCSC(=S)N2CCCC2)C(=O)c2ccccc12
: