Target
LIP1, secretory lipase (Family 3)
Ligand
BDBM50112883
Substrate
Meas. Tech.
ChEMBL_1512202 (CHEMBL3611484)
IC50
24360±n/a nM
Citation
 Guo, SHuang, WZhang, JWang, Y Novel inhibitor against Malassezia globosa LIP1 (SMG1), a potential anti-dandruff target. Bioorg Med Chem Lett 25:3464-7 (2015)  
Target
Name:
LIP1, secretory lipase (Family 3)
Synonyms:
LIP1, secretory lipase (Family 3)
Type:
PROTEIN
Mol. Mass.:
33701.74
Organism:
Malassezia globosa (strain ATCC MYA-4612 / CBS 7966)(Dandruff-associated fungus)
Description:
ChEMBL_109860
Residue:
304
  
Inhibitor
Name:
BDBM50112883
Synonyms:
CHEMBL3609530
Type:
Small organic molecule
Emp. Form.:
C17H22N2OS2
Mol. Mass.:
334.499
SMILES:
O=C1N(CCSC(=S)N2CCCCCC2)Cc2ccccc12
: