Target
Acetylcholinesterase
Ligand
BDBM50114365
Substrate
Meas. Tech.
ChEMBL_1511335 (CHEMBL3606356)
IC50
64±n/a nM
Citation
 Bajda, MJonczyk, JMalawska, BCzarnecka, KGirek, MOlszewska, PSikora, JMikiciuk-Olasik, ESkibinski, RGumieniczek, ASzymanski, P Synthesis, biological evaluation and molecular modeling of new tetrahydroacridine derivatives as potential multifunctional agents for the treatment of Alzheimer's disease. Bioorg Med Chem 23:5610-8 (2015)  
Target
Name:
Acetylcholinesterase
Synonyms:
ACES_HUMAN Acetylcholinesterase (AChE) | Acetylcholinesterase (human AChE)
Type:
Enzyme
Mol. Mass.:
67792.70
Organism:
Homo sapiens (Human)
Description:
P22303
Residue:
614
  
Inhibitor
Name:
BDBM50114365
Synonyms:
CHEMBL3604196
Type:
Small organic molecule
Emp. Form.:
C28H37ClN4O
Mol. Mass.:
481.073
SMILES:
Cl.CN(C)c1ccc(cc1)C(=O)NCCCCCCNc1c2CCCCc2nc2ccccc12
: