Target
D-amino-acid oxidase
Ligand
BDBM50117763
Substrate
Meas. Tech.
ChEMBL_1515821 (CHEMBL3614583)
Ki
60±n/a nM
Citation
 Hin, NDuvall, BFerraris, DAlt, JThomas, AGRais, RRojas, CWu, YWozniak, KMSlusher, BSTsukamoto, T 6-Hydroxy-1,2,4-triazine-3,5(2H,4H)-dione Derivatives as Novel D-Amino Acid Oxidase Inhibitors. J Med Chem 58:7258-72 (2015)  
Target
Name:
D-amino-acid oxidase
Synonyms:
D-amino-acid oxidase (DAAO) DAMOX OXDA_HUMAN
Type:
Homodimer
Mol. Mass.:
39476.06
Organism:
Homo sapiens (Human)
Description:
P14920
Residue:
347
  
Inhibitor
Name:
BDBM50117763
Synonyms:
CHEMBL3613921 | US9505753, 5u
Type:
Small organic molecule
Emp. Form.:
C14H11N3O3
Mol. Mass.:
269.2554
SMILES:
Oc1nn(Cc2cccc3ccccc23)c(=O)[nH]c1=O
: