Target
CCR4-NOT transcription complex subunit 7
Ligand
BDBM50119770
Substrate
Meas. Tech.
ChEMBL_1518114 (CHEMBL3619397)
IC50
9900±n/a nM
Citation
 Jadhav, GPKaur, IMaryati, MAirhihen, BFischer, PMWinkler, GS Discovery, synthesis and biochemical profiling of purine-2,6-dione derivatives as inhibitors of the human poly(A)-selective ribonuclease Caf1. Bioorg Med Chem Lett 25:4219-24 (2015)  
Target
Name:
CCR4-NOT transcription complex subunit 7
Synonyms:
BTG1-binding factor 1 CAF1 CCR4-associated factor 1 CNOT7_HUMAN | Caf1a
Type:
PROTEIN
Mol. Mass.:
32730.66
Organism:
Homo sapiens (Human)
Description:
ChEMBL_109881
Residue:
285
  
Inhibitor
Name:
BDBM50119770
Synonyms:
CHEMBL3616521
Type:
Small organic molecule
Emp. Form.:
C22H30N4O3
Mol. Mass.:
398.4986
SMILES:
CCCCCCCCCn1c2ncn(CCc3ccccc3)c2c(=O)n(O)c1=O
: