Target
Growth factor receptor-bound protein 7
Ligand
BDBM50124406
Substrate
Meas. Tech.
ChEMBL_1520389 (CHEMBL3624252)
Kd
2100±n/a nM
Citation
 Watson, GMGunzburg, MJAmbaye, NDLucas, WATraore, DAKulkarni, KCergol, KMPayne, RJPanjikar, SPero, SCPerlmutter, PWilce, MCWilce, JA Cyclic Peptides Incorporating Phosphotyrosine Mimetics as Potent and Specific Inhibitors of the Grb7 Breast Cancer Target. J Med Chem 58:7707-18 (2015)  
Target
Name:
Growth factor receptor-bound protein 7
Synonyms:
B47 GRB7 GRB7_HUMAN
Type:
PROTEIN
Mol. Mass.:
59700.56
Organism:
Homo sapiens (Human)
Description:
ChEMBL_699661
Residue:
532
  
Inhibitor
Name:
BDBM50124406
Synonyms:
CHEMBL3623450
Type:
Small organic molecule
Emp. Form.:
C68H80N14O20S
Mol. Mass.:
1445.51
SMILES:
[H][C@@]12CCCN1C(=O)[C@H](Cc1ccccc1)NC(=O)[C@@]([H])(NC(=O)[C@H](CC(N)=O)NC(=O)[C@H](CC(O)=O)NC(=O)[C@H](Cc1ccc(cc1)C(O)=O)NC(=O)CNC(=O)[C@H](CCC(O)=O)NC(=O)[C@H](Cc1ccccc1)NC(=O)[C@H](Cc1cc3ccccc3[nH]1)NC(=O)CSC[C@H](NC2=O)C(N)=O)[C@@H](C)O
: