Target
Carbonic anhydrase 4
Ligand
BDBM9461
Substrate
Meas. Tech.
ChEBML_1523542
Temperature
298.15±n/a K
Ki
7079±n/a nM
Comments
extracted
Citation
 Karioti, ACeruso, MCarta, FBilia, ARSupuran, CT New natural product carbonic anhydrase inhibitors incorporating phenol moieties. Bioorg Med Chem 23:7219-25 (2015)  
Target
Name:
Carbonic anhydrase 4
Synonyms:
CA-IV CAH4_HUMAN Carbonic anhydrase Carbonic anhydrase IV (CA IV)
Type:
Enzyme
Mol. Mass.:
35037.98
Organism:
Homo sapiens (Human)
Description:
P22748
Residue:
312
  
Inhibitor
Name:
BDBM9461
Synonyms:
5,7-dihydroxy-3-(4-methoxyphenyl)-4H-chromen-4-one Biochanin A (BCA) CHEMBL131921 | cid_5280373
Type:
Small organic molecule
Emp. Form.:
C16H12O5
Mol. Mass.:
284.2635
SMILES:
COc1ccc(cc1)-c1coc2cc(O)cc(O)c2c1=O
: