Target
Acetylcholinesterase
Ligand
BDBM50130207
Substrate
Meas. Tech.
ChEMBL_1525144 (CHEMBL3635482)
IC50
>100000±n/a nM
Citation
 Al-Rashid, ZFHsung, RP A computational view on the significance of E-ring in binding of (+)-arisugacin A to acetylcholinesterase. Bioorg Med Chem Lett 25:4848-53 (2015)  
Target
Name:
Acetylcholinesterase
Synonyms:
ACES_HUMAN Acetylcholinesterase (AChE) | Acetylcholinesterase (human AChE)
Type:
Enzyme
Mol. Mass.:
67792.70
Organism:
Homo sapiens (Human)
Description:
P22303
Residue:
614
  
Inhibitor
Name:
BDBM50130207
Synonyms:
CHEMBL3632855
Type:
Small organic molecule
Emp. Form.:
C27H34O5
Mol. Mass.:
438.5559
SMILES:
[H][C@@]12CC[C@@]3(C)Oc4cc(oc(=O)c4C[C@]3([H])[C@@]1(C)CC[C@H](O)C2(C)C)-c1ccc(OC)cc1
: