Target
Acetylcholinesterase
Ligand
BDBM50130208
Substrate
Meas. Tech.
ChEMBL_1525144 (CHEMBL3635482)
IC50
>100000±n/a nM
Citation
 Al-Rashid, ZFHsung, RP A computational view on the significance of E-ring in binding of (+)-arisugacin A to acetylcholinesterase. Bioorg Med Chem Lett 25:4848-53 (2015)  
Target
Name:
Acetylcholinesterase
Synonyms:
ACES_HUMAN Acetylcholinesterase (AChE) | Acetylcholinesterase (human AChE)
Type:
Enzyme
Mol. Mass.:
67792.70
Organism:
Homo sapiens (Human)
Description:
P22303
Residue:
614
  
Inhibitor
Name:
BDBM50130208
Synonyms:
CHEMBL3632854
Type:
Small organic molecule
Emp. Form.:
C27H34O6
Mol. Mass.:
454.5553
SMILES:
[H][C@]12Cc3c(O[C@]1(C)CC[C@@]1(O)C(C)(C)[C@H](O)CC[C@]21C)cc(oc3=O)-c1ccc(OC)cc1
: