Target
Acetylcholinesterase
Ligand
BDBM50089621
Substrate
Meas. Tech.
ChEMBL_1525144 (CHEMBL3635482)
IC50
26±n/a nM
Citation
 Al-Rashid, ZFHsung, RP A computational view on the significance of E-ring in binding of (+)-arisugacin A to acetylcholinesterase. Bioorg Med Chem Lett 25:4848-53 (2015)  
Target
Name:
Acetylcholinesterase
Synonyms:
ACES_HUMAN Acetylcholinesterase (AChE) | Acetylcholinesterase (human AChE)
Type:
Enzyme
Mol. Mass.:
67792.70
Organism:
Homo sapiens (Human)
Description:
P22303
Residue:
614
  
Inhibitor
Name:
BDBM50089621
Synonyms:
4a,12a-Dihydroxy-9-(4-methoxy-phenyl)-4,4,6a,12b-tetramethyl-4a,6,6a,12,12a,12b-hexahydro-4H,5H-7,10-dioxa-benzo[a]anthracene-1,11-dione | CHEMBL278342
Type:
Small organic molecule
Emp. Form.:
C27H30O7
Mol. Mass.:
466.5229
SMILES:
COc1ccc(cc1)-c1cc2O[C@]3(C)CC[C@@]4(O)C(C)(C)C=CC(=O)[C@]4(C)[C@@]3(O)Cc2c(=O)o1
: