Target
Muscarinic acetylcholine receptor M1
Ligand
BDBM50135204
Substrate
Meas. Tech.
ChEMBL_1545717 (CHEMBL3748814)
EC50
175±n/a nM
Citation
 Davoren, JEO'Neil, SVAnderson, DPBrodney, MAChenard, LDlugolenski, KEdgerton, JRGreen, MGarnsey, MGrimwood, SHarris, ARKauffman, GWLaChapelle, ELazzaro, JTLee, CWLotarski, SMNason, DMObach, RSReinhart, VSalomon-Ferrer, RSteyn, SJWebb, DYan, JZhang, L Design and optimization of selective azaindole amide M1 positive allosteric modulators. Bioorg Med Chem Lett 26:650-5 (2016)  
Target
Name:
Muscarinic acetylcholine receptor M1
Synonyms:
ACM1_HUMAN Cholinergic receptor, muscarinic 1 | Cholinergic, muscarinic M1
Type:
Protein
Mol. Mass.:
51442.54
Organism:
Homo sapiens (Human)
Description:
P11229
Residue:
460
  
Inhibitor
Name:
BDBM50135204
Synonyms:
CHEMBL3747254
Type:
Small organic molecule
Emp. Form.:
C23H23N5O2
Mol. Mass.:
401.461
SMILES:
O=C(NC[C@@H]1CCCO1)c1cn(Cc2ccc(cc2)-n2cccn2)c2cccnc12
: