Target
Muscarinic acetylcholine receptor M1
Ligand
BDBM50135207
Substrate
Meas. Tech.
ChEMBL_1545717 (CHEMBL3748814)
EC50
500±n/a nM
Citation
 Davoren, JEO'Neil, SVAnderson, DPBrodney, MAChenard, LDlugolenski, KEdgerton, JRGreen, MGarnsey, MGrimwood, SHarris, ARKauffman, GWLaChapelle, ELazzaro, JTLee, CWLotarski, SMNason, DMObach, RSReinhart, VSalomon-Ferrer, RSteyn, SJWebb, DYan, JZhang, L Design and optimization of selective azaindole amide M1 positive allosteric modulators. Bioorg Med Chem Lett 26:650-5 (2016)  
Target
Name:
Muscarinic acetylcholine receptor M1
Synonyms:
ACM1_HUMAN Cholinergic receptor, muscarinic 1 | Cholinergic, muscarinic M1
Type:
Protein
Mol. Mass.:
51442.54
Organism:
Homo sapiens (Human)
Description:
P11229
Residue:
460
  
Inhibitor
Name:
BDBM50135207
Synonyms:
CHEMBL3747287
Type:
Small organic molecule
Emp. Form.:
C23H23N5O2
Mol. Mass.:
401.461
SMILES:
OC1(CNC(=O)c2cn(Cc3ccc(cc3)-n3cccn3)c3cccnc23)CCC1
: