Target
CviR transcriptional regulator
Ligand
BDBM50136296
Substrate
Meas. Tech.
ChEMBL_1547614 (CHEMBL3755484)
IC50
97400±n/a nM
Citation
 Bucio-Cano, AReyes-Arellano, ACorrea-Basurto, JBello, MTorres-Jaramillo, JSalgado-Zamora, HCuriel-Quesada, EPeralta-Cruz, JAvila-Sorrosa, A Targeting quorum sensing by designing azoline derivatives to inhibit the N-hexanoyl homoserine lactone-receptor CviR: Synthesis as well as biological and theoretical evaluations. Bioorg Med Chem 23:7565-77 (2015)  
Target
Name:
CviR transcriptional regulator
Synonyms:
Type:
PROTEIN
Mol. Mass.:
29723.76
Organism:
Chromobacterium violaceum
Description:
ChEMBL_765227
Residue:
265
  
Inhibitor
Name:
BDBM50136296
Synonyms:
CHEMBL3754531
Type:
Small organic molecule
Emp. Form.:
C15H21NO2
Mol. Mass.:
247.3327
SMILES:
CCCCCCOc1ccc(cc1)C1=NCCO1
: