Target
Cannabinoid receptor 1
Ligand
BDBM50144618
Substrate
Meas. Tech.
ChEMBL_1551636 (CHEMBL3760882)
Ki
1.9±n/a nM
Citation
 Fulp, AZhang, YBortoff, KSeltzman, HSnyder, RWiethe, RAmato, GMaitra, R Pyrazole antagonists of the CB1 receptor with reduced brain penetration. Bioorg Med Chem 24:1063-70 (2016)  
Target
Name:
Cannabinoid receptor 1
Synonyms:
CANN6 CB-R CNR CNR1_HUMAN Cannabinoid receptor Cannabinoid receptor 1 (brain)
Type:
G Protein-Coupled Receptor (GPCR)
Mol. Mass.:
52868.96
Organism:
Homo sapiens (Human)
Description:
P21554
Residue:
472
  
Inhibitor
Name:
BDBM50144618
Synonyms:
CHEMBL3758534
Type:
Small organic molecule
Emp. Form.:
C24H20Cl3F3N4O2
Mol. Mass.:
559.795
SMILES:
Cc1c(nn(c1-c1ccc(Cl)cc1)-c1ccc(Cl)cc1Cl)C(=O)NC1CCN(CC1)C(=O)C(F)(F)F
: