Target
Potassium voltage-gated channel subfamily H member 2
Ligand
BDBM50139154
Substrate
Meas. Tech.
ChEMBL_1554488 (CHEMBL3767785)
IC50
>33000±n/a nM
Citation
 Huang, SCAdhikari, SAfroze, RBrewer, KCalderwood, EFChouitar, JEngland, DBFisher, CGalvin, KMGaulin, JGreenspan, PDHarrison, SJKim, MSLangston, SPMa, LTMenon, SMizutani, HRezaei, MSmith, MDZhang, DMGould, AE Optimization of tetrahydronaphthalene inhibitors of Raf with selectivity over hERG. Bioorg Med Chem Lett 26:1156-60 (2016)  
Target
Name:
Potassium voltage-gated channel subfamily H member 2
Synonyms:
1,3-beta-glucan synthase component GLS2 ERG Eag-related protein 1 Ether-a-go-go-related gene (HERG) Ether-a-go-go-related gene potassium channel 1 Ether-a-go-go-related gene potassium channel 1 (hERG1) Ether-a-go-go-related protein 1 H-ERG KCNH2 Potassium voltage-gated channel subfamily H member 2 (hERG) Voltage-gated potassium channel subunit Kv11.1 hERG Potassium Channel 1 | putative potassium channel subunit
Type:
Multi-pass membrane protein
Mol. Mass.:
126672.65
Organism:
Homo sapiens (Human)
Description:
Q12809
Residue:
1159
  
Inhibitor
Name:
BDBM50139154
Synonyms:
CHEMBL3765074
Type:
Small organic molecule
Emp. Form.:
C29H24F3N5O3
Mol. Mass.:
547.5278
SMILES:
FC(F)(F)c1cc(cc(c1)-c1cc[nH]n1)C(=O)N[C@@H]1CCc2ccc(Oc3ccnc4NC(=O)CCc34)cc2C1
: