Target
Type-2 angiotensin II receptor
Ligand
BDBM50009338
Substrate
Meas. Tech.
ChEMBL_1555129 (CHEMBL3768051)
Ki
0.380000±n/a nM
Citation
 Sallander, JWallinder, CHallberg, AÅqvist, JGutiérrez-de-Terán, H Structural determinants of subtype selectivity and functional activity of angiotensin II receptors. Bioorg Med Chem Lett 26:1355-9 (2016)  
Target
Name:
Type-2 angiotensin II receptor
Synonyms:
AGTR2 AT2 Angiotensin II type 2 (AT-2) receptor Type-2 angiotensin II receptor
Type:
Enzyme Catalytic Domain
Mol. Mass.:
41201.61
Organism:
Homo sapiens (Human)
Description:
Angiotensin II, central 0 0::P50052
Residue:
363
  
Inhibitor
Name:
BDBM50009338
Synonyms:
(S)-2-((S)-1-((S)-2-((S)-2-((S)-2-((S)-2-((S)-5-(diaminomethyleneamino)-2-(2-(methylamino)acetamido)pentanamido)-3-methylbutanamido)-3-(4-hydroxyphenyl)propanamido)-3-methylbutanamido)-3-(1H-imidazol-5-yl)propanoyl)pyrrolidine-5-carboxamido)propanoic acid SARALASIN Sar-Arg-Val-Tyr-Val-His-Pro-Ala (sarlasin) | [Sar1-Arg2-Val3-Tyr4-Val5-His6-Pro7-Ala8]
Type:
Small organic molecule
Emp. Form.:
C42H65N13O10
Mol. Mass.:
912.0466
SMILES:
CNCC(=O)N[C@@H](CCCN=C(N)N)C(=O)N[C@@H](C(C)C)C(=O)N[C@@H](Cc1ccc(O)cc1)C(=O)N[C@@H](C(C)C)C(=O)N[C@@H](Cc1cnc[nH]1)C(=O)N1CCC[C@H]1C(=O)N[C@@H](C)C(O)=O
: