Target
Protein cereblon
Ligand
BDBM50026473
Substrate
Meas. Tech.
ChEMBL_1555516 (CHEMBL3768098)
IC50
181000000±n/a nM
Citation
 Boichenko, IDeiss, SBär, KHartmann, MDHernandez Alvarez, B A FRET-Based Assay for the Identification and Characterization of Cereblon Ligands. J Med Chem 59:770-4 (2016)  
Target
Name:
Protein cereblon
Synonyms:
CRBN | CRBN_HUMAN
Type:
PROTEIN
Mol. Mass.:
50537.73
Organism:
Homo sapiens (Human)
Description:
ChEMBL_116917
Residue:
442
  
Inhibitor
Name:
BDBM50026473
Synonyms:
CHEMBL25028 dimethyl sulfone methylsulfonylmethane sulphonylbismethane
Type:
Small organic molecule
Emp. Form.:
C2H6O2S
Mol. Mass.:
94.133
SMILES:
CS(C)(=O)=O
: