Target
Carbonic anhydrase 1
Ligand
BDBM50147752
Substrate
Meas. Tech.
ChEMBL_1555887 (CHEMBL3767104)
Ki
9.0±n/a nM
Citation
 Alafeefy, AMCarta, FCeruso, MAl-Tamimi, AMAl-Kahtani, AASupuran, CT Development of 3-(4-aminosulphonyl)-phenyl-2-mercapto-3H-quinazolin-4-ones as inhibitors of carbonic anhydrase isoforms involved in tumorigenesis and glaucoma. Bioorg Med Chem 24:1402-7 (2016)  
Target
Name:
Carbonic anhydrase 1
Synonyms:
CA-I CAB Carbonate dehydratase I Carbonic anhydrase 1 (CA I) Carbonic anhydrase 1 (Recombinant CA I) Carbonic anhydrase B Carbonic anhydrase I (CA I) Carbonic anhydrase I (CAI) Carbonic anhydrase isoenzyme I (hCA I) | hCA
Type:
Enzyme
Mol. Mass.:
28873.37
Organism:
Homo sapiens (Human)
Description:
P00915
Residue:
261
  
Inhibitor
Name:
BDBM50147752
Synonyms:
CHEMBL3763877
Type:
Small organic molecule
Emp. Form.:
C17H17N3O6S2
Mol. Mass.:
423.463
SMILES:
COc1cc2c(nc(S)n(-c3ccc(cc3)S(N)(=O)=O)c2=O)c(OC)c1OC
: