Target
Carbonic anhydrase 9
Ligand
BDBM50147762
Substrate
Meas. Tech.
ChEMBL_1555889 (CHEMBL3767106)
Ki
15±n/a nM
Citation
 Alafeefy, AMCarta, FCeruso, MAl-Tamimi, AMAl-Kahtani, AASupuran, CT Development of 3-(4-aminosulphonyl)-phenyl-2-mercapto-3H-quinazolin-4-ones as inhibitors of carbonic anhydrase isoforms involved in tumorigenesis and glaucoma. Bioorg Med Chem 24:1402-7 (2016)  
Target
Name:
Carbonic anhydrase 9
Synonyms:
CA-IX CAH9_HUMAN Carbonic anhydrase 9 (CA IX) Carbonic anhydrase 9 precursor Carbonic anhydrase IX (CAIX) Carbonic anhydrases; II & IX MN RCC-associated antigen G250
Type:
Enzyme
Mol. Mass.:
49669.03
Organism:
Homo sapiens (Human)
Description:
Catalytic domain of human cloned isozyme was used in the assay
Residue:
459
  
Inhibitor
Name:
BDBM50147762
Synonyms:
CHEMBL3765033
Type:
Small organic molecule
Emp. Form.:
C14H10IN3O3S2
Mol. Mass.:
459.282
SMILES:
NS(=O)(=O)c1ccc(cc1)-n1c(S)nc2c(I)cccc2c1=O
: