Target
NAD-dependent protein deacetylase sirtuin-1
Ligand
BDBM27507
Substrate
Meas. Tech.
ChEMBL_1557234 (CHEMBL3773609)
IC50
50000±n/a nM
Citation
 Schiedel, MRumpf, TKaraman, BLehotzky, AOláh, JGerhardt, SOvádi, JSippl, WEinsle, OJung, M Aminothiazoles as Potent and Selective Sirt2 Inhibitors: A Structure-Activity Relationship Study. J Med Chem 59:1599-612 (2016)  
Target
Name:
NAD-dependent protein deacetylase sirtuin-1
Synonyms:
NAD-Dependent Deacetylase Sirtuin-1 NAD-dependent protein deacetylase sirtuin-1 (SIRT1) SIR2-like protein 1 SIRT1 Sirtuin-1 (SIRT1) | hSIR2
Type:
Developmental protein; hydrolase
Mol. Mass.:
81626.66
Organism:
Homo sapiens (Human)
Description:
Residue:
747
  
Inhibitor
Name:
BDBM27507
Synonyms:
3-Pyridinecarboxamide NAM nicotinamide | pyridine-3-carboxamide
Type:
Emp. Form.:
C6H6N2O
Mol. Mass.:
122.1246
SMILES:
NC(=O)c1cccnc1
: