Target
Lysine-specific demethylase 4D
Ligand
BDBM50122002
Substrate
Meas. Tech.
ChEBML_1558374
IC50
1585±n/a nM
Citation
 Westaway, SMPreston, AGBarker, MDBrown, FBrown, JACampbell, MChung, CWDrewes, GEagle, RGarton, NGordon, LHaslam, CHayhow, TGHumphreys, PGJoberty, GKatso, RKruidenier, LLeveridge, MPemberton, MRioja, ISeal, GAShipley, TSingh, OSuckling, CJTaylor, JThomas, PWilson, DMLee, KPrinjha, RK Cell Penetrant Inhibitors of the KDM4 and KDM5 Families of Histone Lysine Demethylases. 2. Pyrido[3,4-d]pyrimidin-4(3H)-one Derivatives. J Med Chem 59:1370-87 (2016)  
Target
Name:
Lysine-specific demethylase 4D
Synonyms:
JHDM3D JMJD2D Jumonji domain-containing protein 2D KDM4D_HUMAN | Lysine-specific demethylase 4D
Type:
PROTEIN
Mol. Mass.:
58627.79
Organism:
Homo sapiens (Human)
Description:
ChEMBL_102441
Residue:
523
  
Inhibitor
Name:
BDBM50122002
Synonyms:
CHEMBL1383671
Type:
Small organic molecule
Emp. Form.:
C6H6N2O2
Mol. Mass.:
138.124
SMILES:
Nc1cnccc1C(O)=O
: