Target
Vascular endothelial growth factor receptor 2
Ligand
BDBM50152591
Substrate
Meas. Tech.
ChEMBL_1563782 (CHEMBL3784202)
IC50
3680±n/a nM
Citation
 Eldehna, WMAbou-Seri, SMEl Kerdawy, AMAyyad, RRHamdy, AMGhabbour, HAAli, MMAbou El Ella, DA Increasing the binding affinity of VEGFR-2 inhibitors by extending their hydrophobic interaction with the active site: Design, synthesis and biological evaluation of 1-substituted-4-(4-methoxybenzyl)phthalazine derivatives. Eur J Med Chem 113:50-62 (2016)  
Target
Name:
Vascular endothelial growth factor receptor 2
Synonyms:
CD_antigen=CD309 Fetal liver kinase 1 (FLK-1) KDR Protein-tyrosine kinase receptor Flk-1 VEGFR-2 VEGFR2 Vascular Endothelial Growth Factor Receptor Kinase 2 Vascular endothelial growth factor receptor 2 (KDR) Vascular endothelial growth factor receptor 2 (VEGFR2) Vascular endothelial growth factor receptor-2 (VEGFR-2)
Type:
Receptor Tyrosine Kinase
Mol. Mass.:
151510.97
Organism:
Homo sapiens (Human)
Description:
P35968
Residue:
1356
  
Inhibitor
Name:
BDBM50152591
Synonyms:
CHEMBL3780801
Type:
Small organic molecule
Emp. Form.:
C22H18ClN3O
Mol. Mass.:
375.851
SMILES:
COc1ccc(Cc2nnc(Nc3ccccc3Cl)c3ccccc23)cc1
: