Target
NUAK family SNF1-like kinase 1
Ligand
BDBM50152595
Substrate
Meas. Tech.
ChEMBL_1564745 (CHEMBL3784252)
IC50
2.0±n/a nM
Citation
 Simov, VDeshmukh, SVDinsmore, CJElwood, FFernandez, RBGarcia, YGibeau, CGunaydin, HJung, JKatz, JDKraybill, BLapointe, BPatel, SBSiu, TSu, HYoung, JR Structure-based design and development of (benz)imidazole pyridones as JAK1-selective kinase inhibitors. Bioorg Med Chem Lett 26:1803-8 (2016)  
Target
Name:
NUAK family SNF1-like kinase 1
Synonyms:
ARK5 NUAK1 OMPHK1
Type:
PROTEIN
Mol. Mass.:
74326.51
Organism:
Homo sapiens (Human)
Description:
ChEMBL_1451343
Residue:
661
  
Inhibitor
Name:
BDBM50152595
Synonyms:
CHEMBL3780091
Type:
Small organic molecule
Emp. Form.:
C18H21N5O
Mol. Mass.:
323.3922
SMILES:
N[C@H]1CC[C@H](CC1)Nc1cc[nH]c(=O)c1-c1nc2ccccc2[nH]1
: