Target
Corticotropin-releasing factor receptor 1
Ligand
BDBM50153495
Substrate
Meas. Tech.
ChEMBL_1560862 (CHEMBL3778934)
Ki
0.500000±n/a nM
Citation
 Erchegyi, JWang, LGulyas, JSamant, MPerrin, MHLewis, KMiller, CVaughan, JDonaldson, CFischer, WLow, WYakabi, SKarasawa, HTaché, YRivier, CRivier, J Characterization of Multisubstituted Corticotropin Releasing Factor (CRF) Peptide Antagonists (Astressins). J Med Chem 59:854-66 (2016)  
Target
Name:
Corticotropin-releasing factor receptor 1
Synonyms:
CRF-R CRF1 CRFR1 CRH-R 1 CRHR1 Corticotropin-releasing factor receptor 1 (CRF-1) Corticotropin-releasing hormone receptor 1
Type:
Enzyme
Mol. Mass.:
50744.31
Organism:
Homo sapiens (Human)
Description:
P34998
Residue:
444
  
Inhibitor
Name:
BDBM50153495
Synonyms:
CHEMBL3774594
Type:
Small organic molecule
Emp. Form.:
C186H298N52O49
Mol. Mass.:
4046.6753
SMILES:
CCCCC(NC(=O)[C@H](CCC(O)=O)NC(=O)[C@H](CC(C)C)NC(=O)[C@@H](NC(=O)[C@H](CCC(O)=O)NC(=O)[C@H](CCCNC(N)=N)NC(=O)[C@H](CC(C)C)NC(=O)[C@H](CC(C)C)NC(=O)[C@H](Cc1cnc[nH]1)NC(=O)[C@@H](Cc1ccccc1)NC(=O)[C@@H](NC(=O)[C@H](CC(C)C)NC(=O)[C@H](CC(O)=O)NC(C)=O)[C@@H](C)O)C(C)C)C(=O)N[C@@H](C)C(=O)N[C@@H](CCCNC(N)=N)C(=O)N[C@@H](C)C(=O)N[C@@H](CCC(O)=O)C(=O)N[C@@H](CCC(N)=O)C(=O)NC(C)(CC(C)C)C(=O)N[C@@H](C)C(=O)N[C@@H](CCC(N)=O)C(=O)N[C@H]1CCC(=O)NCCCC[C@H](NC(=O)[C@H](Cc2cnc[nH]2)NC(=O)[C@H](C)NC1=O)C(=O)N[C@@H](CC(N)=O)C(=O)N[C@@H](CCCNC(N)=N)C(=O)N[C@@H](CCCCN)C(=O)N[C@@H](CC(C)C)C(=O)NC(Cc1cccc2ccccc12)C(=O)N[C@@H](CCC(O)=O)C(=O)NC(C)(CC(C)C)C(=O)N[C@@H]([C@@H](C)CC)C(N)=O
: