Target
Hepatocyte growth factor receptor
Ligand
BDBM50156347
Substrate
Meas. Tech.
ChEBML_1567106
IC50
1.000000±n/a nM
Citation
 Lu, DShen, ALiu, YPeng, XXing, WAi, JGeng, MHu, Y Design and synthesis of novel benzo[d]oxazol-2(3H)-one derivatives bearing 7-substituted-4-enthoxyquinoline moieties as c-Met kinase inhibitors. Eur J Med Chem 115:191-200 (2016)  
Target
Name:
Hepatocyte growth factor receptor
Synonyms:
Hepatocyte growth factor receptor Hepatocyte growth factor receptor (c-MET) MET Met proto-oncogene (hepatocyte growth factor receptor) Tyrosine-protein kinase Met (c-Met) c-Met kinase
Type:
Protein
Mol. Mass.:
155559.73
Organism:
Homo sapiens (Human)
Description:
P08581
Residue:
1390
  
Inhibitor
Name:
BDBM50156347
Synonyms:
CHEMBL3786898
Type:
Small organic molecule
Emp. Form.:
C26H22N6O3
Mol. Mass.:
466.4913
SMILES:
Cn1cc(cn1)-c1ccc2n(CCOc3ccnc4cc(ccc34)-c3cnn(C)c3)c(=O)oc2c1
: