Target
Hepatocyte growth factor receptor
Ligand
BDBM50157645
Substrate
Meas. Tech.
ChEBML_1567106
IC50
16±n/a nM
Citation
 Lu, DShen, ALiu, YPeng, XXing, WAi, JGeng, MHu, Y Design and synthesis of novel benzo[d]oxazol-2(3H)-one derivatives bearing 7-substituted-4-enthoxyquinoline moieties as c-Met kinase inhibitors. Eur J Med Chem 115:191-200 (2016)  
Target
Name:
Hepatocyte growth factor receptor
Synonyms:
Hepatocyte growth factor receptor Hepatocyte growth factor receptor (c-MET) MET Met proto-oncogene (hepatocyte growth factor receptor) Tyrosine-protein kinase Met (c-Met) c-Met kinase
Type:
Protein
Mol. Mass.:
155559.73
Organism:
Homo sapiens (Human)
Description:
P08581
Residue:
1390
  
Inhibitor
Name:
BDBM50157645
Synonyms:
CHEMBL3787308
Type:
Small organic molecule
Emp. Form.:
C20H18N2O5
Mol. Mass.:
366.3673
SMILES:
COc1ccc2n(CCOc3ccnc4cc(OC)ccc34)c(=O)oc2c1
: