Target
Hepatocyte growth factor receptor
Ligand
BDBM50161095
Substrate
Meas. Tech.
ChEMBL_1567106 (CHEMBL3792084)
IC50
94±n/a nM
Citation
 Lu, DShen, ALiu, YPeng, XXing, WAi, JGeng, MHu, Y Design and synthesis of novel benzo[d]oxazol-2(3H)-one derivatives bearing 7-substituted-4-enthoxyquinoline moieties as c-Met kinase inhibitors. Eur J Med Chem 115:191-200 (2016)  
Target
Name:
Hepatocyte growth factor receptor
Synonyms:
Hepatocyte growth factor receptor Hepatocyte growth factor receptor (c-MET) MET Met proto-oncogene (hepatocyte growth factor receptor) Tyrosine-protein kinase Met (c-Met) c-Met kinase
Type:
Protein
Mol. Mass.:
155559.73
Organism:
Homo sapiens (Human)
Description:
P08581
Residue:
1390
  
Inhibitor
Name:
BDBM50161095
Synonyms:
CHEMBL3786753
Type:
Small organic molecule
Emp. Form.:
C21H18N2O6
Mol. Mass.:
394.3774
SMILES:
COC(=O)c1ccc2oc(=O)n(CCOc3ccnc4cc(OC)ccc34)c2c1
: