Target
Acetylcholinesterase
Ligand
BDBM50214744
Substrate
Meas. Tech.
ChEMBL_1571406 (CHEMBL3796602)
IC50
>100000±n/a nM
Citation
 Pan, WHu, KBai, PYu, LMa, QLi, TZhang, XChen, CPeng, KLiu, WSang, Z Design, synthesis and evaluation of novel ferulic acid-memoquin hybrids as potential multifunctional agents for the treatment of Alzheimer's disease. Bioorg Med Chem Lett 26:2539-43 (2016)  
Target
Name:
Acetylcholinesterase
Synonyms:
ACES_ELEEL Acetylcholinesterase (EeAChE) | ache
Type:
Enzyme
Mol. Mass.:
71812.79
Organism:
Electrophorus electricus (Electric eel)
Description:
Residue:
633
  
Inhibitor
Name:
BDBM50214744
Synonyms:
(2E)-3-(4-hydroxy-3-methoxyphenyl)prop-2-enoic acid CHEMBL32749 ferulic acid
Type:
Small organic molecule
Emp. Form.:
C10H10O4
Mol. Mass.:
194.184
SMILES:
COc1cc(\C=C\C(O)=O)ccc1O
: