Target
Lysine-specific demethylase 4C
Ligand
BDBM191600
Substrate
Meas. Tech.
ChEMBL_1566307 (CHEMBL3788934)
IC50
100±n/a nM
Citation
 McAllister, TEEngland, KSHopkinson, RJBrennan, PEKawamura, ASchofield, CJ Recent Progress in Histone Demethylase Inhibitors. J Med Chem 59:1308-29 (2016)  
Target
Name:
Lysine-specific demethylase 4C
Synonyms:
GASC-1 protein Gene amplified in squamous cell carcinoma 1 protein JMJD2C Jumonji domain-containing protein 2C KDM4C_HUMAN | KIAA0780
Type:
Protein
Mol. Mass.:
119979.01
Organism:
Homo sapiens (Human)
Description:
Q9H3R0
Residue:
1056
  
Inhibitor
Name:
BDBM191600
Synonyms:
2-(5-((4-chloro-2-methylbenzyl)oxy)-1Hpyrazol-1-yl)isonicotinic acid (N19) US9604961, Example 89 US9908865, Example 89
Type:
Small organic molecule
Emp. Form.:
C17H14ClN3O3
Mol. Mass.:
343.764
SMILES:
Cc1cc(Cl)ccc1COc1ccnn1-c1cc(ccn1)C(O)=O
: