Target
Lysine-specific demethylase 5A
Ligand
BDBM191600
Substrate
Meas. Tech.
ChEMBL_1566310 (CHEMBL3788937)
IC50
<100±n/a nM
Citation
 McAllister, TEEngland, KSHopkinson, RJBrennan, PEKawamura, ASchofield, CJ Recent Progress in Histone Demethylase Inhibitors. J Med Chem 59:1308-29 (2016)  
Target
Name:
Lysine-specific demethylase 5A
Synonyms:
Histone demethylase JARID1A Jumonji/ARID domain-containing protein 1A KDM5A_HUMAN RBBP-2 RBP2 | Retinoblastoma-binding protein 2
Type:
Protein
Mol. Mass.:
192091.79
Organism:
Homo sapiens (Human)
Description:
P29375
Residue:
1690
  
Inhibitor
Name:
BDBM191600
Synonyms:
2-(5-((4-chloro-2-methylbenzyl)oxy)-1Hpyrazol-1-yl)isonicotinic acid (N19) US9604961, Example 89 US9908865, Example 89
Type:
Small organic molecule
Emp. Form.:
C17H14ClN3O3
Mol. Mass.:
343.764
SMILES:
Cc1cc(Cl)ccc1COc1ccnn1-c1cc(ccn1)C(O)=O
: