Target
Lysine-specific demethylase 5B
Ligand
BDBM191600
Substrate
Meas. Tech.
ChEMBL_1566306 (CHEMBL3788933)
IC50
<100±n/a nM
Citation
 McAllister, TEEngland, KSHopkinson, RJBrennan, PEKawamura, ASchofield, CJ Recent Progress in Histone Demethylase Inhibitors. J Med Chem 59:1308-29 (2016)  
Target
Name:
Lysine-specific demethylase 5B
Synonyms:
CT31 Histone demethylase JARID1B Jumonji/ARID domain-containing protein 1B KDM5B_HUMAN Lysine-specific demethylase 5B (KDM5Flag-5B-FL) PLU1 RBP2-H1 | Retinoblastoma-binding protein 2 homolog 1
Type:
Protein
Mol. Mass.:
175659.67
Organism:
Homo sapiens (Human)
Description:
Q9UGL1
Residue:
1544
  
Inhibitor
Name:
BDBM191600
Synonyms:
2-(5-((4-chloro-2-methylbenzyl)oxy)-1Hpyrazol-1-yl)isonicotinic acid (N19) US9604961, Example 89 US9908865, Example 89
Type:
Small organic molecule
Emp. Form.:
C17H14ClN3O3
Mol. Mass.:
343.764
SMILES:
Cc1cc(Cl)ccc1COc1ccnn1-c1cc(ccn1)C(O)=O
: