Target
Lysine-specific demethylase 6A
Ligand
BDBM50158858
Substrate
Meas. Tech.
ChEMBL_1566335 (CHEMBL3789214)
IC50
>2500±n/a nM
Citation
 McAllister, TEEngland, KSHopkinson, RJBrennan, PEKawamura, ASchofield, CJ Recent Progress in Histone Demethylase Inhibitors. J Med Chem 59:1308-29 (2016)  
Target
Name:
Lysine-specific demethylase 6A
Synonyms:
Histone demethylase UTX KDM6A_HUMAN Lysine-specific demethylase 6A (KDM6A(UTX)) UTX Ubiquitously-transcribed X chromosome tetratricopeptide repeat protein
Type:
Protein
Mol. Mass.:
154198.48
Organism:
Homo sapiens (Human)
Description:
O15550
Residue:
1401
  
Inhibitor
Name:
BDBM50158858
Synonyms:
CHEMBL3786409
Type:
Small organic molecule
Emp. Form.:
C17H26F3N5O2
Mol. Mass.:
389.4158
SMILES:
CCN(CCN(C)C)C(=O)CNCc1cc(CNC(=O)C(F)(F)F)ccn1
: