Target
Sodium/glucose cotransporter 1
Ligand
BDBM50161656
Substrate
Meas. Tech.
ChEMBL_1567442 (CHEMBL3790125)
EC50
1859±n/a nM
Citation
 Chu, KFYao, CHSong, JSChen, CTYeh, TKHsieh, TCHuang, CYWang, MHWu, SHChang, WEChao, YSLee, JC N-Indolylglycosides bearing modifications at the glucose C6-position as sodium-dependent glucose co-transporter 2 inhibitors. Bioorg Med Chem 24:2242-50 (2016)  
Target
Name:
Sodium/glucose cotransporter 1
Synonyms:
High affinity sodium-glucose cotransporter Na(+)/glucose cotransporter 1 SGLT1 Sodium-dependent glucose cotransporter 1 (SGLT1) Sodium/glucose cotransporter 1 (SGLT1) | Solute carrier family 5 member 1
Type:
Protein
Mol. Mass.:
73503.78
Organism:
Homo sapiens (Human)
Description:
P13866
Residue:
664
  
Inhibitor
Name:
BDBM50161656
Synonyms:
CHEMBL3786435
Type:
Small organic molecule
Emp. Form.:
C28H29ClN4O6
Mol. Mass.:
553.006
SMILES:
COC(=O)c1cn(C[C@H]2O[C@H]([C@H](O)[C@@H](O)[C@@H]2O)n2cc(Cc3ccc(cc3)C3CC3)c3c(Cl)cccc23)nn1
: