Target
Sodium/glucose cotransporter 1
Ligand
BDBM50161720
Substrate
Meas. Tech.
ChEMBL_1567442 (CHEMBL3790125)
EC50
3813±n/a nM
Citation
 Chu, KFYao, CHSong, JSChen, CTYeh, TKHsieh, TCHuang, CYWang, MHWu, SHChang, WEChao, YSLee, JC N-Indolylglycosides bearing modifications at the glucose C6-position as sodium-dependent glucose co-transporter 2 inhibitors. Bioorg Med Chem 24:2242-50 (2016)  
Target
Name:
Sodium/glucose cotransporter 1
Synonyms:
High affinity sodium-glucose cotransporter Na(+)/glucose cotransporter 1 SGLT1 Sodium-dependent glucose cotransporter 1 (SGLT1) Sodium/glucose cotransporter 1 (SGLT1) | Solute carrier family 5 member 1
Type:
Protein
Mol. Mass.:
73503.78
Organism:
Homo sapiens (Human)
Description:
P13866
Residue:
664
  
Inhibitor
Name:
BDBM50161720
Synonyms:
CHEMBL3787651
Type:
Small organic molecule
Emp. Form.:
C29H33ClN2O7
Mol. Mass.:
557.035
SMILES:
CCOC(=O)CC(=O)NC[C@H]1O[C@H]([C@H](O)[C@@H](O)[C@@H]1O)n1cc(Cc2ccc(cc2)C2CC2)c2c(Cl)cccc12
: