Target
Tyrosyl-DNA phosphodiesterase 2
Ligand
BDBM50161993
Substrate
Meas. Tech.
ChEMBL_1572464 (CHEMBL3796255)
IC50
5200±n/a nM
Citation
 Kankanala, JMarchand, CAbdelmalak, MAihara, HPommier, YWang, Z Isoquinoline-1,3-diones as Selective Inhibitors of Tyrosyl DNA Phosphodiesterase II (TDP2). J Med Chem 59:2734-46 (2016)  
Target
Name:
Tyrosyl-DNA phosphodiesterase 2
Synonyms:
EAP2 ETS1-associated protein 2 TDP2 TTRAP Tyr-DNA phosphodiesterase 2 Tyrosyl-DNA phosphodiesterase 2 (hTDP2) VPg unlinkase | hTDP2
Type:
Enzyme Catalytic Domain
Mol. Mass.:
40916.54
Organism:
Homo sapiens (Human)
Description:
gi_23510348
Residue:
362
  
Inhibitor
Name:
BDBM50161993
Synonyms:
CHEMBL3792475
Type:
Small organic molecule
Emp. Form.:
C10H7NO4
Mol. Mass.:
205.1669
SMILES:
OC(=O)c1ccc2CC(=O)NC(=O)c2c1
: