Target
Tyrosyl-DNA phosphodiesterase 2
Ligand
BDBM50161975
Substrate
Meas. Tech.
ChEMBL_1572464 (CHEMBL3796255)
IC50
5300±n/a nM
Citation
 Kankanala, JMarchand, CAbdelmalak, MAihara, HPommier, YWang, Z Isoquinoline-1,3-diones as Selective Inhibitors of Tyrosyl DNA Phosphodiesterase II (TDP2). J Med Chem 59:2734-46 (2016)  
Target
Name:
Tyrosyl-DNA phosphodiesterase 2
Synonyms:
EAP2 ETS1-associated protein 2 TDP2 TTRAP Tyr-DNA phosphodiesterase 2 Tyrosyl-DNA phosphodiesterase 2 (hTDP2) VPg unlinkase | hTDP2
Type:
Enzyme Catalytic Domain
Mol. Mass.:
40916.54
Organism:
Homo sapiens (Human)
Description:
gi_23510348
Residue:
362
  
Inhibitor
Name:
BDBM50161975
Synonyms:
CHEMBL3793616
Type:
Small organic molecule
Emp. Form.:
C15H9ClFNO2
Mol. Mass.:
289.689
SMILES:
Fc1ccc(cc1Cl)-c1ccc2C(=O)NC(=O)Cc2c1
: