Target
Tyrosyl-DNA phosphodiesterase 2
Ligand
BDBM50161982
Substrate
Meas. Tech.
ChEMBL_1572461 (CHEMBL3796252)
IC50
1700±n/a nM
Citation
 Kankanala, JMarchand, CAbdelmalak, MAihara, HPommier, YWang, Z Isoquinoline-1,3-diones as Selective Inhibitors of Tyrosyl DNA Phosphodiesterase II (TDP2). J Med Chem 59:2734-46 (2016)  
Target
Name:
Tyrosyl-DNA phosphodiesterase 2
Synonyms:
EAP2 ETS1-associated protein 2 TDP2 TTRAP Tyr-DNA phosphodiesterase 2 Tyrosyl-DNA phosphodiesterase 2 (hTDP2) VPg unlinkase | hTDP2
Type:
Enzyme Catalytic Domain
Mol. Mass.:
40916.54
Organism:
Homo sapiens (Human)
Description:
gi_23510348
Residue:
362
  
Inhibitor
Name:
BDBM50161982
Synonyms:
CHEMBL3792690
Type:
Small organic molecule
Emp. Form.:
C15H10ClNO2
Mol. Mass.:
271.698
SMILES:
Clc1cccc(c1)-c1ccc2CC(=O)NC(=O)c2c1
: