Target
Nucleotide-binding oligomerization domain-containing protein 2
Ligand
BDBM50164885
Substrate
Meas. Tech.
ChEMBL_1576528 (CHEMBL3803968)
EC50
46±n/a nM
Citation
 Gobec, MMlinaric-Ra?can, IDolenc, MSJakopin, ? Structural requirements of acylated Gly-l-Ala-d-Glu analogs for activation of the innate immune receptor NOD2. Eur J Med Chem 116:1-12 (2016)  
Target
Name:
Nucleotide-binding oligomerization domain-containing protein 2
Synonyms:
CARD15 IBD1 NOD2 Nucleotide-binding oligomerization domain-containing protein 2 | nucleotide-binding oligomerization domain containing 2
Type:
PROTEIN
Mol. Mass.:
115287.18
Organism:
Homo sapiens (Human)
Description:
ChEMBL_1454053
Residue:
1040
  
Inhibitor
Name:
BDBM50164885
Synonyms:
CHEBI:59414 | muramyldipeptide
Type:
Small organic molecule
Emp. Form.:
C19H32N4O11
Mol. Mass.:
492.4776
SMILES:
C[C@H](NC(=O)[C@@H](C)O[C@H]1[C@H](O)[C@@H](CO)O[C@@H](O)[C@@H]1NC(C)=O)C(=O)N[C@H](CCC(O)=O)C(N)=O
: