Target
Tyrosine-protein kinase receptor UFO
Ligand
BDBM50165465
Substrate
Meas. Tech.
ChEMBL_1573699 (CHEMBL3802634)
IC50
>1000±n/a nM
Citation
 Zhan, ZPeng, XLiu, QChen, FJi, YYao, SXi, YLin, YChen, TXu, YAi, JGeng, MDuan, W Discovery of 6-(difluoro(6-(4-fluorophenyl)-[1,2,4]triazolo[4,3-b][1,2,4]triazin-3-yl)methyl)quinoline as a highly potent and selective c-Met inhibitor. Eur J Med Chem 116:239-251 (2016)  
Target
Name:
Tyrosine-protein kinase receptor UFO
Synonyms:
AXL TEL/AXL UFO | UFO_HUMAN
Type:
Enzyme
Mol. Mass.:
98316.97
Organism:
Homo sapiens (Human)
Description:
P30530
Residue:
894
  
Inhibitor
Name:
BDBM50165465
Synonyms:
CHEMBL3797579
Type:
Small organic molecule
Emp. Form.:
C20H11F3N6
Mol. Mass.:
392.3367
SMILES:
Fc1ccc(cc1)-c1cnc2nnc(n2n1)C(F)(F)c1ccc2ncccc2c1
: