Target
Hepatocyte growth factor receptor/Nucleoprotein TPR
Ligand
BDBM163243
Substrate
Meas. Tech.
ChEMBL_1573704 (CHEMBL3802639)
IC50
8.6±n/a nM
Citation
 Zhan, ZPeng, XLiu, QChen, FJi, YYao, SXi, YLin, YChen, TXu, YAi, JGeng, MDuan, W Discovery of 6-(difluoro(6-(4-fluorophenyl)-[1,2,4]triazolo[4,3-b][1,2,4]triazin-3-yl)methyl)quinoline as a highly potent and selective c-Met inhibitor. Eur J Med Chem 116:239-251 (2016)  
Target
Name:
Hepatocyte growth factor receptor/Nucleoprotein TPR
Synonyms:
TPR/MET fusion protein
Type:
Mol. Mass.:
Description:
ASSAY_ID of ChEMBL is 1573704
Components:
This complex has 2 components.
Component 1
Name:
Nucleoprotein TPR
Synonyms:
NPC-associated intranuclear protein TPR_MOUSE Translocated promoter region and nuclear basket protein
Type:
PROTEIN
Mol. Mass.:
273882.63
Organism:
Mus musculus
Description:
ChEMBL_107942
Residue:
2431
  
Component 2
Name:
Hepatocyte growth factor receptor
Synonyms:
Hepatocyte growth factor receptor Met Tyrosine Kinase c-Met
Type:
PROTEIN
Mol. Mass.:
153561.53
Organism:
Mus musculus
Description:
ChEMBL_820938
Residue:
1379
  
Inhibitor
Name:
BDBM163243
Synonyms:
US9062045, Comparator No. 1 (JNJ-38877605)
Type:
Small organic molecule
Emp. Form.:
C19H13F2N7
Mol. Mass.:
377.3502
SMILES:
Cn1cc(cn1)-c1ccc2nnc(n2n1)C(F)(F)c1ccc2ncccc2c1
: