Target
Nucleoprotein TPR
Ligand
BDBM50165469
Substrate
Meas. Tech.
ChEMBL_1573471 (CHEMBL3801044)
IC50
80±n/a nM
Citation
 Zhan, ZPeng, XLiu, QChen, FJi, YYao, SXi, YLin, YChen, TXu, YAi, JGeng, MDuan, W Discovery of 6-(difluoro(6-(4-fluorophenyl)-[1,2,4]triazolo[4,3-b][1,2,4]triazin-3-yl)methyl)quinoline as a highly potent and selective c-Met inhibitor. Eur J Med Chem 116:239-251 (2016)  
Target
Name:
Nucleoprotein TPR
Synonyms:
NPC-associated intranuclear protein TPR_MOUSE Translocated promoter region and nuclear basket protein
Type:
PROTEIN
Mol. Mass.:
273882.63
Organism:
Mus musculus
Description:
ChEMBL_107942
Residue:
2431
  
Inhibitor
Name:
BDBM50165469
Synonyms:
CHEMBL3797911
Type:
Small organic molecule
Emp. Form.:
C21H16N6O2
Mol. Mass.:
384.3907
SMILES:
COc1ccc2c(OCc3nnc4ncc(nn34)-c3ccccc3)ccnc2c1
: