Target
Hepatocyte growth factor receptor
Ligand
BDBM50165500
Substrate
Meas. Tech.
ChEMBL_1573468 (CHEMBL3801041)
IC50
127±n/a nM
Citation
 Zhan, ZPeng, XLiu, QChen, FJi, YYao, SXi, YLin, YChen, TXu, YAi, JGeng, MDuan, W Discovery of 6-(difluoro(6-(4-fluorophenyl)-[1,2,4]triazolo[4,3-b][1,2,4]triazin-3-yl)methyl)quinoline as a highly potent and selective c-Met inhibitor. Eur J Med Chem 116:239-251 (2016)  
Target
Name:
Hepatocyte growth factor receptor
Synonyms:
Hepatocyte growth factor receptor Hepatocyte growth factor receptor (c-MET) MET Met proto-oncogene (hepatocyte growth factor receptor) Tyrosine-protein kinase Met (c-Met) c-Met kinase
Type:
Protein
Mol. Mass.:
155559.73
Organism:
Homo sapiens (Human)
Description:
P08581
Residue:
1390
  
Inhibitor
Name:
BDBM50165500
Synonyms:
CHEMBL3798974
Type:
Small organic molecule
Emp. Form.:
C19H14N6O
Mol. Mass.:
342.3541
SMILES:
Oc1cccc(c1)-c1cnc2nnc(Cc3c[nH]c4ccccc34)n2n1
: