Target
E3 ubiquitin-protein ligase Mdm2
Ligand
BDBM50165694
Substrate
Meas. Tech.
ChEMBL_1574254 (CHEMBL3802437)
Kd
500±n/a nM
Citation
 Tian, YMa, YGibeau, CRLahue, BRShipps, GWStrickland, CBogen, SL Structure-activity relationship study of 4-substituted piperidines at Leu26 moiety of novel p53-hDM2 inhibitors. Bioorg Med Chem Lett 26:2735-8 (2016)  
Target
Name:
E3 ubiquitin-protein ligase Mdm2
Synonyms:
Double minute 2 protein E3 ubiquitin-protein ligase Mdm2 (p53-binding protein Mdm2) Human Double Minute 2 (HDM2) MDM2-MDMX p53-Binding Protein MDM2 | p53-binding protein
Type:
Oncoprotein
Mol. Mass.:
55196.54
Organism:
Homo sapiens (Human)
Description:
Q00987
Residue:
491
  
Inhibitor
Name:
BDBM50165694
Synonyms:
CHEMBL3139629
Type:
Small organic molecule
Emp. Form.:
C29H27F6N5O3
Mol. Mass.:
607.5468
SMILES:
FC(F)(F)c1ccc(OC2(CCCN(C2)C(=O)c2cnccc2C(F)(F)F)C(=O)N2CCN(CC2)c2ccccn2)cc1
: