Target
P2X purinoceptor 7
Ligand
BDBM173348
Substrate
Meas. Tech.
ChEMBL_1580957 (CHEMBL3812625)
IC50
10.0±n/a nM
Citation
 Abdel-Magid, AF Promising Therapeutic Potential of P2X7 Modulators. ACS Med Chem Lett 7:348-50 (2016)  
Target
Name:
P2X purinoceptor 7
Synonyms:
ATP receptor P2X purinoceptor 7 P2X purinoceptor 7 (P2X7) P2X7 rat P2rx7 | Purinergic receptor
Type:
Protein
Mol. Mass.:
68403.50
Organism:
Rattus norvegicus (Rat)
Description:
Q64663
Residue:
595
  
Inhibitor
Name:
BDBM173348
Synonyms:
US10323032, Example 66 US9604982, Example 66
Type:
Small organic molecule
Emp. Form.:
C20H16ClF4N5O
Mol. Mass.:
453.821
SMILES:
C[C@@H]1Cc2c(CN1C(=O)c1ccc(F)c(c1Cl)C(F)(F)F)nc(C)nc2-c1ccn[nH]1
: