Target
Fatty acid-binding protein, adipocyte
Ligand
BDBM50177673
Substrate
Meas. Tech.
ChEMBL_1583389 (CHEMBL3816121)
Ki
120±n/a nM
Citation
 Tagami, UTakahashi, KIgarashi, SEjima, CYoshida, TTakeshita, SMiyanaga, WSugiki, MTokumasu, MHatanaka, TKashiwagi, TIshikawa, KMiyano, HMizukoshi, T Interaction Analysis of FABP4 Inhibitors by X-ray Crystallography and Fragment Molecular Orbital Analysis. ACS Med Chem Lett 7:435-9 (2016)  
Target
Name:
Fatty acid-binding protein, adipocyte
Synonyms:
A-FABP ALBP FABP4 Fatty acid binding protein adipocyte Fatty acid-binding protein 4 (FABP4)
Type:
Enzyme
Mol. Mass.:
14719.23
Organism:
Homo sapiens (Human)
Description:
P15090
Residue:
132
  
Inhibitor
Name:
BDBM50177673
Synonyms:
CHEMBL3814575
Type:
Small organic molecule
Emp. Form.:
C26H23NO2
Mol. Mass.:
381.4663
SMILES:
OC(=O)CCn1c(c(-c2ccccc2)c2cc(ccc12)C1CC1)-c1ccccc1
: