Target
Tyrosyl-DNA phosphodiesterase 2
Ligand
BDBM50179184
Substrate
Meas. Tech.
ChEMBL_1582562 (CHEMBL3816824)
IC50
4100±n/a nM
Citation
 Kossmann, BRAbdelmalak, MLopez, STender, GYan, CPommier, YMarchand, CIvanov, I Discovery of selective inhibitors of tyrosyl-DNA phosphodiesterase 2 by targeting the enzyme DNA-binding cleft. Bioorg Med Chem Lett 26:3232-3236 (2016)  
Target
Name:
Tyrosyl-DNA phosphodiesterase 2
Synonyms:
EAP2 ETS1-associated protein 2 TDP2 TTRAP Tyr-DNA phosphodiesterase 2 Tyrosyl-DNA phosphodiesterase 2 (hTDP2) VPg unlinkase | hTDP2
Type:
Enzyme Catalytic Domain
Mol. Mass.:
40916.54
Organism:
Homo sapiens (Human)
Description:
gi_23510348
Residue:
362
  
Inhibitor
Name:
BDBM50179184
Synonyms:
CHEMBL264425
Type:
Small organic molecule
Emp. Form.:
C20H20N2O6S2
Mol. Mass.:
448.513
SMILES:
OC(=O)C(CSSCC(NC(=O)c1ccccc1)C(O)=O)NC(=O)c1ccccc1
: