Target
Acetylcholinesterase
Ligand
BDBM50180593
Substrate
Meas. Tech.
ChEMBL_1583841 (CHEMBL3815273)
IC50
8400±n/a nM
Citation
 Leong, SWAbas, FLam, KWShaari, KLajis, NH 2-Benzoyl-6-benzylidenecyclohexanone analogs as potent dual inhibitors of acetylcholinesterase and butyrylcholinesterase. Bioorg Med Chem 24:3742-51 (2016)  
Target
Name:
Acetylcholinesterase
Synonyms:
ACES_ELEEL Acetylcholinesterase (EeAChE) | ache
Type:
Enzyme
Mol. Mass.:
71812.79
Organism:
Electrophorus electricus (Electric eel)
Description:
Residue:
633
  
Inhibitor
Name:
BDBM50180593
Synonyms:
CHEMBL3815025
Type:
Small organic molecule
Emp. Form.:
C20H17BrO2
Mol. Mass.:
369.252
SMILES:
OC1=C(CCC\C1=C/c1ccccc1Br)C(=O)c1ccccc1
: