Target
Acetylcholinesterase
Ligand
BDBM50180614
Substrate
Meas. Tech.
ChEMBL_1583841 (CHEMBL3815273)
IC50
7600±n/a nM
Citation
 Leong, SWAbas, FLam, KWShaari, KLajis, NH 2-Benzoyl-6-benzylidenecyclohexanone analogs as potent dual inhibitors of acetylcholinesterase and butyrylcholinesterase. Bioorg Med Chem 24:3742-51 (2016)  
Target
Name:
Acetylcholinesterase
Synonyms:
ACES_ELEEL Acetylcholinesterase (EeAChE) | ache
Type:
Enzyme
Mol. Mass.:
71812.79
Organism:
Electrophorus electricus (Electric eel)
Description:
Residue:
633
  
Inhibitor
Name:
BDBM50180614
Synonyms:
CHEMBL3601737
Type:
Small organic molecule
Emp. Form.:
C24H20O2
Mol. Mass.:
340.4144
SMILES:
OC1=C(CCC\C1=C/c1cccc2ccccc12)C(=O)c1ccccc1
: